{"text_format":"1","workbook":"xlsx","n_sheets":5,"sheets":["Planilha Orcamentaria - Tipo 3","CPUs - Geral","Histograma Equiptos - Geral","Histograma MO - Geral","Cronograma FF Tipo 3"],"not_rendered":{"charts":0,"images":1,"macros":1,"external_links":1,"defined_names":24,"comments":0,"pivot_tables":0},"unopened":[],"bounds":{"document_bytes":16777216,"sheet_cells":100000,"rows_first":2000,"rows_last":500,"rows_between":2000,"halvings":0,"cell_chars":16384,"cell_head_chars":4096},"cells_cut":0,"cells_raw":0,"read":"whole","date_system":"1900"}

{"sheet":"Planilha Orcamentaria - Tipo 3","index":0,"n_rows":1082,"n_cols":26,"rows_kept":1082,"cut":false,"hidden":false,"merged":[[2,18,2,20]]}
[]
[]
[null,null,null,"Campo de Cálculo",null,null," ",null,null,null,"Planilha orçamentária - CER III - Tipo 3 (Ref.: Brasília, Agosto/2014, com desoneração)",null,null,null,null,null,null,null,"Itens variáveis "]
[null,null,5,2]
[]
[null,null,null,null,null,null,{"$f":"MAX(D18:D1082)","v":2}]
[]
[]
[null,null,2,2,null,{"$f":"SUM(D18:D1082)","v":519},{"$f":"SUBTOTAL(9,D18:D1082)","v":519},null,null,null,null,null,null,"Área total",1362.87,{"$f":"P17/O9","v":0}]
[null,null,"1900-01-05"]
[]
[]
[null,null,null,null,null,null,null,null,null,null,null,null,null,"Distorcao somatorio",{"$f":"SUM(P19,P21,P35,P45,P123,P139,P149,P159,P173,P315,P329,P417,P447,P469,P487,P549,P579,P629,P647,P677,P693,P797,P809,P823,P861,P885,P901,P921,P927,P1017,P1037,P1061,P1067,P1075)-P17","v":0}]
[null,null,{"$f":"cont","v":{"$error":"#NAME?"}}]
[null,null,"C2","Cod","Itens Filhos","Cod. Pai","Linha CPU",null,"Código SINAPI","Item","Descrição / Serviço","Observação","Un","Qtd","Unit.","Total (R$)","%"]
[]
[null,null,null,null,null,null,null,null,null,null,"TOTAL",null,null,null,null,null,null,null,null,null,{"$f":"SUMPRODUCT(S19:S1082,T19:T1082)+U19","v":0}]
[]
[null,null,{"$f":"LEN(J19)","v":2},{"$f":"COUNTIF($J$18:$J$1082,J19)","v":1},{"$f":"IF(E20=0,1,E20)","v":1},{"$f":"IF(C19=2,\"\",LEFT(J19,C19-3))","v":""},null,null,null,"01","BDI ",null,""]
[null,null,{"$f":"C19","v":2},null,{"$f":"SUM(IF(LEFT($J19:$J$1082,C19)=J19,1))-1","v":0}]
[null,null,{"$f":"LEN(J21)","v":2},{"$f":"COUNTIF($J$18:$J$1082,J21)","v":1},{"$f":"IF(E22=0,1,E22)","v":6},{"$f":"IF(C21=2,\"\",LEFT(J21,C21-3))","v":""},null,null,null,"02","SERVIÇOS PRELIMINARES ",null,""]
[null,null,{"$f":"C21","v":2},null,{"$f":"SUM(IF(LEFT($J21:$J$1082,C21)=J21,1))-1","v":6}]
[null,null,{"$f":"LEN(J23)","v":5},{"$f":"COUNTIF($J$18:$J$1082,J23)","v":1},{"$f":"IF(E24=0,1,E24)","v":5},{"$f":"IF(C23=2,\"\",LEFT(J23,C23-3))","v":"02"},null,null,null,"02.01","Barracão de obras ",null,""]
[null,null,{"$f":"C23","v":5},null,{"$f":"SUM(IF(LEFT($J23:$J$1082,C23)=J23,1))-1","v":5}]
[null,null,{"$f":"LEN(J25)","v":8},{"$f":"COUNTIF($J$18:$J$1082,J25)","v":1},{"$f":"IF(E26=0,1,E26)","v":1},{"$f":"IF(C25=2,\"\",LEFT(J25,C25-3))","v":"02.01"},null,null,"73805/001","02.01.01","Barracão de obras para alojamento ou escritório, piso em pinho de 3º, paredes em compensado esp. 10mm e cobertura em telha amianto esp. 6mm, incluindo instalações elétricas e esquadrias ",null,"M2",15]
[null,null,{"$f":"C25","v":8},null,{"$f":"SUM(IF(LEFT($J25:$J$1082,C25)=J25,1))-1","v":0},null,null,null,null,null,null,null,null,0]
[null,null,{"$f":"LEN(J27)","v":8},{"$f":"COUNTIF($J$18:$J$1082,J27)","v":1},{"$f":"IF(E28=0,1,E28)","v":1},{"$f":"IF(C27=2,\"\",LEFT(J27,C27-3))","v":"02.01"},null,null,"74210/001","02.01.02","Barracão para depósito em tábuas de madeira, cobertura em fibrocimento esp. 4mm, incluindo piso em argamassa traço 1:6 (cimento e areia)",null,"M2",12]
[null,null,{"$f":"C27","v":8},null,{"$f":"SUM(IF(LEFT($J27:$J$1082,C27)=J27,1))-1","v":0},null,null,null,null,null,null,null,null,0]
[null,null,{"$f":"LEN(J29)","v":8},{"$f":"COUNTIF($J$18:$J$1082,J29)","v":1},{"$f":"IF(E30=0,1,E30)","v":1},{"$f":"IF(C29=2,\"\",LEFT(J29,C29-3))","v":"02.01"},null,null,"74242/001","02.01.03","Barracão de obra para banheiro em chapa de madeira compensada, cobertura em fibrocimetno esp. 4mm, incluindo instalações hidro-sanitarias e elétricas ",null,"M2",12]
[null,null,{"$f":"C29","v":8},null,{"$f":"SUM(IF(LEFT($J29:$J$1082,C29)=J29,1))-1","v":0},null,null,null,null,null,null,null,null,0]
[null,null,{"$f":"LEN(J31)","v":8},{"$f":"COUNTIF($J$18:$J$1082,J31)","v":1},{"$f":"IF(E32=0,1,E32)","v":1},{"$f":"IF(C31=2,\"\",LEFT(J31,C31-3))","v":"02.01"},null,null,"74209/001","02.01.04","Placa de obra em capa de aço galvanizado",null,"M2",6]
[null,null,{"$f":"C31","v":8},null,{"$f":"SUM(IF(LEFT($J31:$J$1082,C31)=J31,1))-1","v":0},null,null,null,null,null,null,null,null,0]
[null,null,{"$f":"LEN(J33)","v":8},{"$f":"COUNTIF($J$18:$J$1082,J33)","v":1},{"$f":"IF(E34=0,1,E34)","v":1},{"$f":"IF(C33=2,\"\",LEFT(J33,C33-3))","v":"02.01"},null,null,"74220/001","02.01.05","Tapume de compensado (estimativa de 70m de fechamento)",null,"M2",{"$f":"70*2.2","v":154}]
[null,null,{"$f":"C33","v":8},null,{"$f":"SUM(IF(LEFT($J33:$J$1082,C33)=J33,1))-1","v":0},null,null,null,null,null,null,null,null,0]
[null,null,{"$f":"LEN(J35)","v":2},{"$f":"COUNTIF($J$18:$J$1082,J35)","v":1},{"$f":"IF(E36=0,1,E36)","v":4},{"$f":"IF(C35=2,\"\",LEFT(J35,C35-3))","v":""},null,null,null,"03","EQUIPE TÉCNICA ",null,null,0]
[null,null,{"$f":"C35","v":2},null,{"$f":"SUM(IF(LEFT($J35:$J$1082,C35)=J35,1))-1","v":4},null,null,null,null,null,null,null,null,0]
[null,null,{"$f":"LEN(J37)","v":5},{"$f":"COUNTIF($J$18:$J$1082,J37)","v":1},{"$f":"IF(E38=0,1,E38)","v":1},{"$f":"IF(C37=2,\"\",LEFT(J37,C37-3))","v":"03"},null,null,"CPU0001","03.01","Engenheiro ou arquiteto Pleno",null,"Mês",12]
[null,null,{"$f":"C37","v":5},null,{"$f":"SUM(IF(LEFT($J37:$J$1082,C37)=J37,1))-1","v":0},null,null,null,null,null,null,null,null,0]
[null,null,{"$f":"LEN(J39)","v":5},{"$f":"COUNTIF($J$18:$J$1082,J39)","v":1},{"$f":"IF(E40=0,1,E40)","v":1},{"$f":"IF(C39=2,\"\",LEFT(J39,C39-3))","v":"03"},null,null,"CPU0002","03.02","Feitor ou encarregado geral",null,"Mês",12]
[null,null,{"$f":"C39","v":5},null,{"$f":"SUM(IF(LEFT($J39:$J$1082,C39)=J39,1))-1","v":0},null,null,null,null,null,null,null,null,0]
[null,null,{"$f":"LEN(J41)","v":5},{"$f":"COUNTIF($J$18:$J$1092,J41)","v":1},{"$f":"IF(E42=0,1,E42)","v":1},{"$f":"IF(C41=2,\"\",LEFT(J41,C41-3))","v":"03"},null,null,"CPU0016","03.03","Almoxarife",null,"Mês",12]
[null,null,{"$f":"C41","v":5},null,{"$f":"SUM(IF(LEFT($J41:$J$1092,C41)=J41,1))-1","v":0},null,null,null,null,null,null,null,null,0]
[null,null,{"$f":"LEN(J43)","v":5},{"$f":"COUNTIF($J$18:$J$1092,J43)","v":1},{"$f":"IF(E44=0,1,E44)","v":1},{"$f":"IF(C43=2,\"\",LEFT(J43,C43-3))","v":"03"},null,null,"CPU0017","03.04","Vigia noturno",null,"Mês",12]
[null,null,{"$f":"C43","v":5},null,{"$f":"SUM(IF(LEFT($J43:$J$1092,C43)=J43,1))-1","v":0},null,null,null,null,null,null,null,null,0]
[null,null,{"$f":"LEN(J45)","v":2},{"$f":"COUNTIF($J$18:$J$1082,J45)","v":1},{"$f":"IF(E46=0,1,E46)","v":38},{"$f":"IF(C45=2,\"\",LEFT(J45,C45-3))","v":""},null,null,null,"04","INFRA ESTRUTURA",null,"",0]
[null,null,{"$f":"C45","v":2},null,{"$f":"SUM(IF(LEFT($J45:$J$1082,C45)=J45,1))-1","v":38},null,null,null,null,null,null,null,null,0]
[null,null,{"$f":"LEN(J47)","v":5},{"$f":"COUNTIF($J$18:$J$1082,J47)","v":1},{"$f":"IF(E48=0,1,E48)","v":5},{"$f":"IF(C47=2,\"\",LEFT(J47,C47-3))","v":"04"},null,null,null,"04.01","Fundação Profunda",null,"",0]
[null,null,{"$f":"C47","v":5},null,{"$f":"SUM(IF(LEFT($J47:$J$1082,C47)=J47,1))-1","v":5},null,null,null,null,null,null,null,null,0]
[null,null,{"$f":"LEN(J49)","v":8},{"$f":"COUNTIF($J$18:$J$1082,J49)","v":1},{"$f":"IF(E50=0,1,E50)","v":4},{"$f":"IF(C49=2,\"\",LEFT(J49,C49-3))","v":"04.01"},null,null,null,"04.01.01","Estacas Escavadas",null,"",0]
[null,null,{"$f":"C49","v":8},null,{"$f":"SUM(IF(LEFT($J49:$J$1082,C49)=J49,1))-1","v":4},null,null,null,null,null,null,null,null,0]
[null,null,{"$f":"LEN(J51)","v":11},{"$f":"COUNTIF($J$18:$J$1082,J51)","v":1},{"$f":"IF(E52=0,1,E52)","v":1},{"$f":"IF(C51=2,\"\",LEFT(J51,C51-3))","v":"04.01.01"},null,null,"73992/001","04.01.01.01","LOCACAO CONVENCIONAL DE OBRA, ATRAVÉS DE GABARITO DE TABUAS CORRIDAS PONTALETADAS A CADA 1,50M, SEM REAPROVEITAMENTO",null,"M2",{"$f":"O9","v":1362.87}]
[null,null,{"$f":"C51","v":11},null,{"$f":"SUM(IF(LEFT($J51:$J$1082,C51)=J51,1))-1","v":0},null,null,null,null,null,null,null,null,0]
[null,null,{"$f":"LEN(J53)","v":11},{"$f":"COUNTIF($J$18:$J$1082,J53)","v":1},{"$f":"IF(E54=0,1,E54)","v":1},{"$f":"IF(C53=2,\"\",LEFT(J53,C53-3))","v":"04.01.01"},null,null,72872,"04.01.01.02","Taxa de mobilização do empreiteiro",null,"EVENTO",1]
[null,null,{"$f":"C53","v":11},null,{"$f":"SUM(IF(LEFT($J53:$J$1082,C53)=J53,1))-1","v":0},null,null,null,null,null,null,null,null,0]
[null,null,{"$f":"LEN(J55)","v":11},{"$f":"COUNTIF($J$18:$J$1082,J55)","v":1},{"$f":"IF(E56=0,1,E56)","v":1},{"$f":"IF(C55=2,\"\",LEFT(J55,C55-3))","v":"04.01.01"},null,null,72819,"04.01.01.03","ESTACA A TRADO (BROCA) DIAMETRO 30CM EM CONCRETO ARMADO MOLDADA IN-LOCO, 20 MPA",null,"M",1643]
[null,null,{"$f":"C55","v":11},null,{"$f":"SUM(IF(LEFT($J55:$J$1082,C55)=J55,1))-1","v":0},null,null,null,null,null,null,null,null,0]
[null,null,{"$f":"LEN(J57)","v":11},{"$f":"COUNTIF($J$18:$J$1082,J57)","v":1},{"$f":"IF(E58=0,1,E58)","v":1},{"$f":"IF(C57=2,\"\",LEFT(J57,C57-3))","v":"04.01.01"},null,null,72209,"04.01.01.04","CARGA MANUAL E REMOCAO E ENTULHO COM TRANSPORTE ATE 1KM EM CAMINHAO BASCULANTE 6M3",null,"M3",117]
[null,null,{"$f":"C57","v":11},null,{"$f":"SUM(IF(LEFT($J57:$J$1082,C57)=J57,1))-1","v":0},null,null,null,null,null,null,null,null,0]
[null,null,{"$f":"LEN(J59)","v":5},{"$f":"COUNTIF($J$18:$J$1082,J59)","v":1},{"$f":"IF(E60=0,1,E60)","v":20},{"$f":"IF(C59=2,\"\",LEFT(J59,C59-3))","v":"04"},null,null,null,"04.02","Fundações Superficiais",null,"",0]
[null,null,{"$f":"C59","v":5},null,{"$f":"SUM(IF(LEFT($J59:$J$1082,C59)=J59,1))-1","v":20},null,null,null,null,null,null,null,null,0]
{"$rows_left_out":1023}
{"sheet":"CPUs - Geral","index":1,"n_rows":169,"n_cols":9,"rows_kept":169,"cut":false,"hidden":false,"merged":[[1,1,1,8]]}
[]
[null,"Composições de preço"]
[]
[null,"Cód. CPU","Cód. Insumo","Fonte Insumo","Descrição","Unidade","Índice","Custo unitário","Custo Total"]
[]
[null,"CPU0001",null,null,"Engenheiro ou arquiteto Pleno","Mês"]
[null,null,2707,"Sinapi","ENGENHEIRO DE OBRA PLENO","HH",220]
[null,null,null,null,"Encargos sociais Mensalistas (48,37%)","VB",1]
[]
[null,"CPU0002",null,null,"Feitor ou encarregado geral","Mês"]
[null,null,4083,"Sinapi","ENCARREGADO GERAL","HH",220]
[null,null,null,null,"Encargos sociais Mensalistas (48,37%)","VB",1]
[]
[null,"CPU0016",null,null,"Almoxarife","Mês"]
[null,null,2707,"Sinapi","Almoxarife","HH",220]
[null,null,null,null,"Encargos sociais Mensalistas (48,37%)","VB",1]
[]
[null,"CPU0017",null,null,"Vigia de obra, escala de trabalho 12x36","Mês"]
[null,null,10508,"Sinapi","Vigia noturno","HH",220]
[]
[null,"CPU0006",null,null,"Cobertura com telha trapezoidal de alumínio esp. 0,7mm - CPU BASE: 84040 \"COBERTURA COM TELHA DE AÇO ZINCADO, TRAPEZOIDAL, ESPESSURA DE 0,50MM, INCLUNDO ACESSÓRIOS\"","M2"]
[null,null,"2700",null,"MONTADOR","H",7.0999999999999994E-2]
[null,null,"6111",null,"SERVENTE","H",5.1400000000000001E-2]
[null,null,"1607",null,"CONJUNTO ARRUELAS DE VEDACAO 5/16\" P/ TELHA FIBROCIMENTO (UMA ARRUELA METALICA E UMA ARRULA PVC - CONICAS)","CJ",2.0499999999999998]
[null,null,null,"Cotação","Telha trrapezoidal de alumínio esp. 0.7mm","M2",1.19]
[null,null,"11029",null,"HASTE RETA P/ GANCHO FG C/ ROSCA - 1/4\" X 30CM - P/ FIXACAO TELHA METALICA - INCL PORCA E ARRUELAS DE VEDACAO","CJ",2.0499999999999998]
[]
[null,"CPU0007",null,null,"Cobertura com telha trapezoidal de alumínio termoacústica esp. 0,7mm+50mm+0,7mm - CPU BASE: 84040 \"COBERTURA COM TELHA DE AÇO ZINCADO, TRAPEZOIDAL, ESPESSURA DE 0,50MM, INCLUNDO ACESSÓRIOS\"","M2"]
[null,null,"2700",null,"MONTADOR","H",7.0999999999999994E-2]
[null,null,"6111",null,"SERVENTE","H",5.1400000000000001E-2]
[null,null,"1607",null,"CONJUNTO ARRUELAS DE VEDACAO 5/16\" P/ TELHA FIBROCIMENTO (UMA ARRUELA METALICA E UMA ARRULA PVC - CONICAS)","CJ",2.0499999999999998]
[null,null,null,"Cotação","Telha trrapezoidal de alumínio esp. 0.7mm","M2",{"$f":"1.03*2","v":2.06}]
[null,null,null,"Cotação","Injeção de poliuretano em telhas termo-acústicas","M2",{"$f":"1.03","v":1.03}]
[null,null,"11029",null,"HASTE RETA P/ GANCHO FG C/ ROSCA - 1/4\" X 30CM - P/ FIXACAO TELHA METALICA - INCL PORCA E ARRUELAS DE VEDACAO","CJ",2.0499999999999998]
[]
[null,"CPU0008",null,null,"D2 - Divisória em vidro temperado 12mm - CPU BASE: 74229/1 \"DIVISORIA EM MARMORE BRANCO POLIDO, ESPESSURA 3 CM, ASSENTADO COM ARGAMASSA TRACO 1:4 (CIMENTO E AREIA), ARREMATE COM CIMENTO BRANCO, EXCLUSIVE FERRAGENS\"","M2"]
[null,null,72120,"Cotação","VIDRO TEMPERADO INCOLOR, ESPESSURA 12MM, FORNECIMENTO E INSTALACAO CLUSIVE MASSA PARA VEDACAO","M2",1]
[null,null,84885,"Sinapi","JOGO DE FERRAGENS CROMADAS PARA PORTA DE VIDRO TEMPERADO, UMA FOLHA COMPOSTO DE DOBRADICAS SUPERIOR E INFERIOR, TRINCO, FECHADURA, CONTRA FECHADURA COM CAPUCHINHO SEM MOLA E PUXADOR","UNID",{"$f":"1/(0.8*2.1)","v":0.59523809523809523}]
[null,null,7321,"SInapi","Mastique elástico a base de silicone ","Bisnaga",0.25]
[null,null,10489,"Sinapi","Vidraceiro","HH",4.8]
[null,null,6111,"Sinapi","Servente","HH",2.2999999999999998]
[]
[null,"CPU0009",null,null,"PC2 - Porta chapeada madeira com visor, pintura esmalte sintético acetinado 80X210 cm CPU BASE: 73934/1\n\"PORTA EM CHAPA DE FIBRA DE EUCALIPTO LISA PARA PINTURA, 80X210X3,5CM, INCLUSO ADUELA 2A, ALIZAR 2A E DOBRADICAS\"","UNID"]
[null,null,1214,"Sinapi","Carpinteiro","HH",2.0499999999999998]
[null,null,4750,"Sinapi","Pedreiro","HH",1.4]
[null,null,6117,"Sinapi","Ajudante de carpinteiro","HH",3.45]
[null,null,88627,"Sinapi","ARGAMASSA TRAÇO 1:0,5:4,5 (CIMENTO, CAL E AREIA MÉDIA) PARA ASSENTAMENTO DE ALVENARIA, PREPARO MANUAL. AF_08/2014","M3",0.01]
[null,null,184,"Sinapi","ADUELA/BATENTE DUPLO/CAIXAO/GRADE CAIXA 13 X 3CM P/ PORTA 0,60 A 1,20 X 2,10M MADEIRA CEDRINHO/PINHO/CANELA OU SIMILAR","JG",1]
[null,null,2427,"Sinapi","DOBRADICA LATAO CROMADO 3 X 3\" SEM ANEIS","UNID",3]
[null,null,4419,"Sinapi","PECA DE MADEIRA DE LEI NATIVA/REGIONAL 10 X 10 X 3 CM P/ FIXACAO \nDE ESQUADRIAS OU RODAPE","UNID",6]
[null,null,11366,"Sinapi","PORTA EUCATEX EUCADUR PRONTA PARA PINTURA 80 X 210 X 3,5CM","UNID",1]
[null,null,20006,"Sinapi","ALIZAR / GUARNICAO 5 X 2CM MADEIRA CEDRO/IMBUIA/JEQUITIBA OU SIMILAR","m",10]
[null,null,20247,"Sinapi","PREGO DE ACO 15 X 15 C/ CABECA","KG",0.6]
[null,null,85010,"Sinapi","Caixilho de alumínio para confecção de visor ","M2",{"$f":"0.6*0.8","v":0.48}]
[null,null,72117,"Sinapi","Vidro liso incolor esp. 4mm","M2",{"$f":"0.6*0.8","v":0.48}]
[]
[null,"CPU0010",null,null,"PH2 - Porta chapeada madeira com visor,  2 folhas (70+70), pintura esm. sintético acetinado 140X210 cm CPU BASE: 73910/3 \"PORTA DE MADEIRA COMPENSADA LISA PARA PINTURA, 70X210X3,5CM, \nINCLUSO ADUELA 2A, ALIZAR 2A E DOBRADICAS\"","UNID"]
[null,null,1214,"Sinapi","Carpinteiro","HH",{"$f":"2.015*1.5","v":3.0225}]
[null,null,4750,"Sinapi","Pedreiro","HH",{"$f":"1.372*1.5","v":2.0580000000000003}]
[null,null,6117,"Sinapi","Ajudante de carpinteiro","HH",{"$f":"3.387*1.5","v":5.0804999999999998}]
{"$rows_left_out":110}
{"sheet":"Histograma Equiptos - Geral","index":2,"n_rows":18,"n_cols":16,"rows_kept":18,"cut":false,"hidden":false,"merged":[]}
[]
[null,1,null,"Histograma de equipamentos "]
[]
[]
[null,null,"Descrição","Unid","Mês 1","Mês 2","Mês 3","Mês 4","Mês 5","Mês 6","Mês 7","Mês 8","Mês 9","Mês 10","Mês 11","Mês 12"]
[null,null,"Ferramentas elétricas ",""]
[null,null,"Furadeira  ","UNID",2,2,2,2,2,2,2,2,2,2,2,2]
[null,null,"Serra mármore ","UNID",2,2,2,2,2,2,2,2,2,2,2,2]
[null,null,"Parafusadeira","UNID",2,2,2,2,2,2,2,2,2,2,2,2]
[null,null,"Equipamentos diversos",""]
[null,null,"Betoneira","MÊS",1,1,1,1,1,1,1,1,1,1,1,1]
[null,null,"Caçamba para limpeza permanente de obra","UNID",4,4,4,8,8,8,8,8,8,8,8,8]
[null,null,"Compactador","MÊS",2,2,2,null,null,null,null,null,null,null,2,2]
[null,null,"Vibrador - Mangote Vibrador","MÊS",3,3,3,3,3]
[null,null,"Vibrador - Motor","MÊS",3,3,3,3,3]
[null,null,"Máquina Policorte","MÊS",1,1,1,1,1,1,1,1,1,1,1,1]
[null,null,"Martelete Elétrico 10Kg","MÊS",1,1,1]
[null,null,"Serra de banca com motor","MÊS",1,1,1,1,1,1,1,1,1,1,1,1]

{"sheet":"Histograma MO - Geral","index":3,"n_rows":15,"n_cols":16,"rows_kept":15,"cut":false,"hidden":false,"merged":[]}
[]
[null,1,null,"Histograma de Mão-de-obra"]
[]
[]
[null,null,"Descrição","Unid","Mês 1","Mês 2","Mês 3","Mês 4","Mês 5","Mês 6","Mês 7","Mês 8","Mês 9","Mês 10","Mês 11","Mês 12"]
[null,null,"Equipe técnica ",""]
[null,null,"Engenheiro civil","Homem x mês",1,1,1,1,1,1,1,1,1,1,1,1]
[null,null,"Encarregado","Homem x mês",1,1,1,1,1,1,1,1,1,1,1,1]
[null,null,"Equipe produtiva",""]
[null,null,"Oficial","Homem x mês",{"$f":"ROUNDUP($E$14*E15/220,0)","v":2},{"$f":"ROUNDUP($E$14*F15/220,0)","v":4},8,14,19,20,19,16,11,6,4,2]
[null,null,"Servente","Homem x mês",{"$f":"E10","v":2},{"$f":"F10","v":4},8,14,19,20,19,16,11,6,4,2]
[]
[]
[null,null,null,"total = ",26000,"hh","oficiais "]
[null,null,null,"Curva S",0.01,3.3000000000000002E-2,6.3E-2,0.113,0.154,0.16900000000000001,0.16,0.127,8.5999999999999993E-2,4.8000000000000001E-2,2.5999999999999999E-2,1.0999999999999999E-2]

{"sheet":"Cronograma FF Tipo 3","index":4,"n_rows":43,"n_cols":17,"rows_kept":43,"cut":false,"hidden":false,"merged":[]}
[]
[null,1,null,"Cronograma físico-financeiro - CER II - Tipo III"]
[]
[]
[null,null,"Item ","Descrição","Valor total com BDI","Mês 1","Mês 2","Mês 3","Mês 4","Mês 5","Mês 6","Mês 7","Mês 8","Mês 9","Mês 10","Mês 11","Mês 12"]
[null,null,"02","SERVIÇOS PRELIMINARES ",{"$f":"VLOOKUP(C6,'Planilha Orcamentaria - Tipo 3'!J:P,COLUMNS(J:P),FALSE)","v":0},1]
[null,null,"03","EQUIPE TÉCNICA",{"$f":"VLOOKUP(C7,'Planilha Orcamentaria - Tipo 3'!J:P,COLUMNS(J:P),FALSE)","v":0},{"$f":"1/12","v":8.3333333333333329E-2},{"$f":"1/12","v":8.3333333333333329E-2},8.3333333333333329E-2,8.3333333333333329E-2,8.3333333333333329E-2,8.3333333333333329E-2,8.3333333333333329E-2,8.3333333333333329E-2,8.3333333333333329E-2,8.3333333333333329E-2,8.3333333333333329E-2,8.3333333333333329E-2]
[null,null,"04","INFRA ESTRUTURA",{"$f":"VLOOKUP(C8,'Planilha Orcamentaria - Tipo 3'!J:P,COLUMNS(J:P),FALSE)","v":0},0.2,0.4,0.4]
[null,null,"05","SUPER ESTRUTURA",{"$f":"VLOOKUP(C9,'Planilha Orcamentaria - Tipo 3'!J:P,COLUMNS(J:P),FALSE)","v":0},null,null,0.1,0.5,0.4]
[null,null,"06","ALVENARIA",{"$f":"VLOOKUP(C10,'Planilha Orcamentaria - Tipo 3'!J:P,COLUMNS(J:P),FALSE)","v":0},null,null,null,0.3,0.4,0.3]
[null,null,"07","COBERTURA",{"$f":"VLOOKUP(C11,'Planilha Orcamentaria - Tipo 3'!J:P,COLUMNS(J:P),FALSE)","v":0},null,null,null,null,0.2,0.8]
[null,null,"08","IMPERMEABILIZAÇÕES ",{"$f":"VLOOKUP(C12,'Planilha Orcamentaria - Tipo 3'!J:P,COLUMNS(J:P),FALSE)","v":0},null,null,null,null,null,0.2,0.8]
[null,null,"09","INSTALAÇÕES ELÉTRICAS PREDIAIS ",{"$f":"VLOOKUP(C13,'Planilha Orcamentaria - Tipo 3'!J:P,COLUMNS(J:P),FALSE)","v":0},null,1.2E-2,0.04,8.1000000000000003E-2,0.13800000000000001,0.17799999999999999,0.18,0.153,0.112,6.2E-2,3.2000000000000001E-2,1.2E-2]
[null,null,"10","SONORIZAÇÃO",{"$f":"VLOOKUP(C14,'Planilha Orcamentaria - Tipo 3'!J:P,COLUMNS(J:P),FALSE)","v":0},null,null,null,null,null,null,null,null,null,0.4,0.5,0.1]
[null,null,"11","REDE DE DADOS",{"$f":"VLOOKUP(C15,'Planilha Orcamentaria - Tipo 3'!J:P,COLUMNS(J:P),FALSE)","v":0},null,null,null,null,null,null,null,null,null,0.4,0.5,0.1]
[null,null,"12","SPDA",{"$f":"VLOOKUP(C16,'Planilha Orcamentaria - Tipo 3'!J:P,COLUMNS(J:P),FALSE)","v":0},null,null,null,null,null,null,null,null,null,0.4,0.5,0.1]
[null,null,"13","DETECÇÃO DE FUMAÇA",{"$f":"VLOOKUP(C17,'Planilha Orcamentaria - Tipo 3'!J:P,COLUMNS(J:P),FALSE)","v":0},null,1.2E-2,0.04,8.1000000000000003E-2,0.13800000000000001,0.17799999999999999,0.18,0.153,0.112,6.2E-2,3.2000000000000001E-2,1.2E-2]
[null,null,"14","CFTV",{"$f":"VLOOKUP(C18,'Planilha Orcamentaria - Tipo 3'!J:P,COLUMNS(J:P),FALSE)","v":0},null,1.2E-2,0.04,8.1000000000000003E-2,0.13800000000000001,0.17799999999999999,0.18,0.153,0.112,6.2E-2,3.2000000000000001E-2,1.2E-2]
[null,null,"15","SUBESTAÇÃO AÉREA",{"$f":"VLOOKUP(C19,'Planilha Orcamentaria - Tipo 3'!J:P,COLUMNS(J:P),FALSE)","v":0},null,0.2,0.3,0.4,0.1]
[null,null,"16","COMBATE A INCÊNDIO",{"$f":"VLOOKUP(C20,'Planilha Orcamentaria - Tipo 3'!J:P,COLUMNS(J:P),FALSE)","v":0},null,1.2E-2,0.04,8.1000000000000003E-2,0.13800000000000001,0.17799999999999999,0.18,0.153,0.112,6.2E-2,3.2000000000000001E-2,1.2E-2]
[null,null,"17","ÁGUA FRIA ",{"$f":"VLOOKUP(C21,'Planilha Orcamentaria - Tipo 3'!J:P,COLUMNS(J:P),FALSE)","v":0},null,1.2E-2,0.04,8.1000000000000003E-2,0.13800000000000001,0.17799999999999999,0.18,0.153,0.112,6.2E-2,3.2000000000000001E-2,1.2E-2]
[null,null,"18","ESGOTO PREDIAL",{"$f":"VLOOKUP(C22,'Planilha Orcamentaria - Tipo 3'!J:P,COLUMNS(J:P),FALSE)","v":0},null,1.2E-2,0.04,8.1000000000000003E-2,0.13800000000000001,0.17799999999999999,0.18,0.153,0.112,6.2E-2,3.2000000000000001E-2,1.2E-2]
[null,null,"19","DRENAGEM PLUVIAL",{"$f":"VLOOKUP(C23,'Planilha Orcamentaria - Tipo 3'!J:P,COLUMNS(J:P),FALSE)","v":0},null,1.2E-2,0.04,8.1000000000000003E-2,0.13800000000000001,0.17799999999999999,0.18,0.153,0.112,6.2E-2,3.2000000000000001E-2,1.2E-2]
[null,null,"20","INSTALAÇÕES GLP",{"$f":"VLOOKUP(C24,'Planilha Orcamentaria - Tipo 3'!J:P,COLUMNS(J:P),FALSE)","v":0},null,null,null,null,null,null,null,null,0.106,0.436,0.373,8.5000000000000006E-2]
[null,null,"21","ESQUADRIAS ",{"$f":"VLOOKUP(C25,'Planilha Orcamentaria - Tipo 3'!J:P,COLUMNS(J:P),FALSE)","v":0},null,null,null,null,null,null,0.3,0.3,0.4]
[null,null,"22","VIDROS",{"$f":"VLOOKUP(C26,'Planilha Orcamentaria - Tipo 3'!J:P,COLUMNS(J:P),FALSE)","v":0},null,null,null,null,null,null,null,null,null,1]
[null,null,"23","MARCENARIA ",{"$f":"VLOOKUP(C27,'Planilha Orcamentaria - Tipo 3'!J:P,COLUMNS(J:P),FALSE)","v":0},null,null,null,null,null,null,null,null,null,null,0.8,0.2]
[null,null,"24","PISOS E PAVIMENTAÇÃO INTERNA",{"$f":"VLOOKUP(C28,'Planilha Orcamentaria - Tipo 3'!J:P,COLUMNS(J:P),FALSE)","v":0},null,null,null,null,null,0.106,0.436,0.373,8.5000000000000006E-2]
[null,null,"25","PISOS E PAVIMENTAÇÃO EXTERNA",{"$f":"VLOOKUP(C29,'Planilha Orcamentaria - Tipo 3'!J:P,COLUMNS(J:P),FALSE)","v":0},null,null,null,null,null,null,null,0.106,0.436,0.373,8.5000000000000006E-2]
[null,null,"26","REVESTIMENTO DE PAREDES INTERNAS",{"$f":"VLOOKUP(C30,'Planilha Orcamentaria - Tipo 3'!J:P,COLUMNS(J:P),FALSE)","v":0},null,null,null,null,null,0.106,0.436,0.373,8.5000000000000006E-2]
[null,null,"27","REVESTIMENTO DE PAREDES EXTERNAS",{"$f":"VLOOKUP(C31,'Planilha Orcamentaria - Tipo 3'!J:P,COLUMNS(J:P),FALSE)","v":0},null,null,null,null,null,null,null,0.106,0.436,0.373,8.5000000000000006E-2]
[null,null,"28","FORROS",{"$f":"VLOOKUP(C32,'Planilha Orcamentaria - Tipo 3'!J:P,COLUMNS(J:P),FALSE)","v":0},null,null,null,null,null,null,null,0.106,0.436,0.373,8.5000000000000006E-2]
[null,null,"29","LOUÇAS E METAIS",{"$f":"VLOOKUP(C33,'Planilha Orcamentaria - Tipo 3'!J:P,COLUMNS(J:P),FALSE)","v":0},null,null,null,null,null,null,null,null,null,0.6,0.4]
[null,null,"30","BANCADAS E PEDRAS",{"$f":"VLOOKUP(C34,'Planilha Orcamentaria - Tipo 3'!J:P,COLUMNS(J:P),FALSE)","v":0},null,null,null,null,null,null,null,null,0.8,0.2]
[null,null,"31","PINTURA ",{"$f":"VLOOKUP(C35,'Planilha Orcamentaria - Tipo 3'!J:P,COLUMNS(J:P),FALSE)","v":0},null,null,null,null,null,null,null,null,0.1,0.5,0.2,0.2]
[null,null,"32","PAISAGISMO",{"$f":"VLOOKUP(C36,'Planilha Orcamentaria - Tipo 3'!J:P,COLUMNS(J:P),FALSE)","v":0},null,null,null,null,null,null,null,null,null,null,null,1]
[null,null,"33","COMUNICAÇÃO VISUAL",{"$f":"VLOOKUP(C37,'Planilha Orcamentaria - Tipo 3'!J:P,COLUMNS(J:P),FALSE)","v":0},null,null,null,null,null,null,null,null,null,null,null,1]
[null,null,"34","DESPESAS FINAIS ",{"$f":"VLOOKUP(C38,'Planilha Orcamentaria - Tipo 3'!J:P,COLUMNS(J:P),FALSE)","v":0},null,null,null,null,null,null,null,null,null,null,null,1]
[null,null,null,"TOTAL",{"$f":"SUM(E6:E38)","v":0}]
[null,null,null,"AVANÇO % MENSAL",null,{"$f":"F42/$E$39","v":{"$error":"#DIV/0!"}},{"$f":"G42/$E$39","v":{"$error":"#DIV/0!"}},{"$error":"#DIV/0!"},{"$error":"#DIV/0!"},{"$error":"#DIV/0!"},{"$error":"#DIV/0!"},{"$error":"#DIV/0!"},{"$error":"#DIV/0!"},{"$error":"#DIV/0!"},{"$error":"#DIV/0!"},{"$error":"#DIV/0!"},{"$error":"#DIV/0!"}]
[null,null,null,"AVANÇO % ACUMULADO",null,{"$f":"F40","v":{"$error":"#DIV/0!"}},{"$f":"G40+F41","v":{"$error":"#DIV/0!"}},{"$f":"H40+G41","v":{"$error":"#DIV/0!"}},{"$error":"#DIV/0!"},{"$error":"#DIV/0!"},{"$error":"#DIV/0!"},{"$error":"#DIV/0!"},{"$error":"#DIV/0!"},{"$error":"#DIV/0!"},{"$error":"#DIV/0!"},{"$error":"#DIV/0!"},{"$error":"#DIV/0!"}]
[null,null,null,"AVANÇO FINANCEIRO MENSAL",null,{"$f":"SUMPRODUCT($E$6:$E$38,F6:F38)","v":0},{"$f":"SUMPRODUCT($E$6:$E$38,G6:G38)","v":0},{"$f":"SUMPRODUCT($E$6:$E$38,H6:H38)","v":0},0,0,0,0,0,0,0,0,0]
[null,null,null,"AVANÇO FINANCEIRO ACUMULADO",null,{"$f":"F42","v":0},{"$f":"G42+F43","v":0},{"$f":"H42+G43","v":0},0,0,0,0,0,0,0,0,0]